{"text_format":"1","workbook":"xlsx","n_sheets":5,"sheets":["Calculator","Data & Calculations","Rates","Rebundled Rates","Changelog"],"not_rendered":{"charts":0,"images":1,"macros":1,"external_links":0,"defined_names":1,"comments":0,"pivot_tables":0},"unopened":[],"bounds":{"document_bytes":16777216,"sheet_cells":100000,"rows_first":2000,"rows_last":500,"rows_between":2000,"halvings":0,"cell_chars":16384,"cell_head_chars":4096},"cells_cut":0,"cells_raw":0,"read":"whole","date_system":"1900"}

{"sheet":"Calculator","index":0,"n_rows":52,"n_cols":10,"rows_kept":52,"cut":false,"hidden":false,"merged":[[51,2,52,9],[3,2,3,8],[7,2,7,8],[30,2,31,9],[34,2,35,9],[41,2,42,9],[37,2,38,9]]}
[]
[]
[null,null,"SVCE Residential Cost Comparison Calculator",null,null,null,null,null,null,"Effective 4/1/2018"]
[]
[]
[null,null,{"$f":"IF(ISNUMBER(SEARCH(\"-1\",D9)),\"Enter Your Total Monthly Usage (kWh)\",\"\")","v":"Enter Your Total Monthly Usage (kWh)"},0,"Select Your Billing Month","May-Oct"]
[null,null,"                   Enter usage for one summer (May-Oct) or one winter (Nov-Apr) month",null,"           Select which range of months your bill falls in"]
[null,null,"Additional Rate Options"]
[null,null,"Non-Basic Rate Schedule","Basic Residential (E-1)"]
[null,null,{"$f":"IF(VLOOKUP($D$9,Rates!$A$2:$H$15,3,FALSE)=FALSE,\"\",\"Summer Peak Usage (kWh)\")","v":""},null,null,{"$f":"IF(VLOOKUP($D$9,Rates!$A$2:$H$15,6,FALSE)=FALSE,\"\",\"Winter Peak Usage (kWh)\")","v":""}]
[null,null,{"$f":"IF(VLOOKUP($D$9,Rates!$A$2:$H$15,4,FALSE)=FALSE,\"\",\"Summer Partial Peak Usage (kWh)\")","v":""},null,null,{"$f":"IF(VLOOKUP($D$9,Rates!$A$2:$H$15,7,FALSE)=FALSE,\"\",\"Winter Partial Peak Usage (kWh)\")","v":""}]
[null,null,{"$f":"IF(VLOOKUP($D$9,Rates!$A$2:$H$15,5,FALSE)=FALSE,\"\",\"Summer Off Peak Usage (kWh)\")","v":""},null,null,{"$f":"IF(VLOOKUP($D$9,Rates!$A$2:$H$15,8,FALSE)=FALSE,\"\",\"Winter Off Peak Usage (kWh)\")","v":""}]
[]
[null,null,null,null,"Optional Information (Default Values Represent a Typical Customer)"]
[null,null,"Days in Billing Cycle",31,null,"Baseline Territory (click for map)",null,"X"]
[null,null,"Primary Heating Source","Gas",null,"PCIA Vintage (from PG&E Delivery page of your bill)",null,2017]
[]
[null,null,"                   (usage details can typically be found on the third page of your bill)"]
[null,null,null,null,"SVCE GreenStart","PG&E Service",null,"SVCE GreenPrime","PG&E Solar 100"]
[null,null,null,"PG&E Delivery Costs",{"$f":"F20","v":0},{"$f":"IFERROR('Data & Calculations'!B74,0)","v":0},null,{"$f":"F20","v":0},{"$f":"IF(D6=\"\",\"$0.00\",F20)","v":0}]
{"$rows_left_out":33}
{"sheet":"Data & Calculations","index":1,"n_rows":77,"n_cols":10,"rows_kept":77,"cut":false,"hidden":false,"merged":[]}
["Determined Bundled Rate (automated)"]
[{"$f":"Calculator!D9","v":"Basic Residential (E-1)"},{"$f":"Rates!B2","v":"All Usage"},{"$f":"Rates!C2","v":"S Pk"},{"$f":"Rates!D2","v":"S Pt"},{"$f":"Rates!E2","v":"S Off"},{"$f":"Rates!F2","v":"W Pk"},{"$f":"Rates!G2","v":"W Pt"},{"$f":"Rates!H2","v":"W Off"},{"$f":"Rates!I2","v":"Meter Charge"},{"$f":"Rates!J2","v":"Minimum Bill"}]
["Tier 1",{"$f":"VLOOKUP(Calculator!$D$9,Rates!$A$3:$AB$17,MATCH(B$2,Rates!$A$2:$J$2,0),FALSE)","v":0.21168999999999999},{"$f":"VLOOKUP(Calculator!$D$9,Rates!$A$3:$AB$17,MATCH(C$2,Rates!$A$2:$J$2,0),FALSE)","v":false},{"$f":"VLOOKUP(Calculator!$D$9,Rates!$A$3:$AB$17,MATCH(D$2,Rates!$A$2:$J$2,0),FALSE)","v":false},{"$f":"VLOOKUP(Calculator!$D$9,Rates!$A$3:$AB$17,MATCH(E$2,Rates!$A$2:$J$2,0),FALSE)","v":false},{"$f":"VLOOKUP(Calculator!$D$9,Rates!$A$3:$AB$17,MATCH(F$2,Rates!$A$2:$J$2,0),FALSE)","v":false},{"$f":"VLOOKUP(Calculator!$D$9,Rates!$A$3:$AB$17,MATCH(G$2,Rates!$A$2:$J$2,0),FALSE)","v":false},{"$f":"VLOOKUP(Calculator!$D$9,Rates!$A$3:$AB$17,MATCH(H$2,Rates!$A$2:$J$2,0),FALSE)","v":false},{"$f":"IFERROR(VLOOKUP(Calculator!$D$9,Rates!$A$3:$AB$17,MATCH(I$2,Rates!$A$2:$J$2,0),FALSE),0)","v":0},{"$f":"IFERROR(VLOOKUP(Calculator!$D$9,Rates!$A$3:$AB$17,MATCH(J2,Rates!$A$2:$J$2,0),FALSE),0)","v":0.32854}]
["Tier 2",{"$f":"VLOOKUP(Calculator!$D$9,Rates!$A$3:$AB$17,MATCH(B$2,Rates!$A$2:$J$2,0)+10,FALSE)","v":0.27993000000000001},{"$f":"VLOOKUP(Calculator!$D$9,Rates!$A$3:$AB$17,MATCH(C$2,Rates!$A$2:$J$2,0)+10,FALSE)","v":false},{"$f":"VLOOKUP(Calculator!$D$9,Rates!$A$3:$AB$17,MATCH(D$2,Rates!$A$2:$J$2,0)+10,FALSE)","v":false},{"$f":"VLOOKUP(Calculator!$D$9,Rates!$A$3:$AB$17,MATCH(E$2,Rates!$A$2:$J$2,0)+10,FALSE)","v":false},{"$f":"VLOOKUP(Calculator!$D$9,Rates!$A$3:$AB$17,MATCH(F$2,Rates!$A$2:$J$2,0)+10,FALSE)","v":false},{"$f":"VLOOKUP(Calculator!$D$9,Rates!$A$3:$AB$17,MATCH(G$2,Rates!$A$2:$J$2,0)+10,FALSE)","v":false},{"$f":"VLOOKUP(Calculator!$D$9,Rates!$A$3:$AB$17,MATCH(H$2,Rates!$A$2:$J$2,0)+10,FALSE)","v":false}]
["Tier 3",{"$f":"VLOOKUP(Calculator!$D$9,Rates!$A$3:$AB$17,MATCH(B$2,Rates!$A$2:$J$2,0)+19,FALSE)","v":0.43342999999999998},{"$f":"VLOOKUP(Calculator!$D$9,Rates!$A$3:$AB$17,MATCH(C$2,Rates!$A$2:$J$2,0)+19,FALSE)","v":false},{"$f":"VLOOKUP(Calculator!$D$9,Rates!$A$3:$AB$17,MATCH(D$2,Rates!$A$2:$J$2,0)+19,FALSE)","v":false},{"$f":"VLOOKUP(Calculator!$D$9,Rates!$A$3:$AB$17,MATCH(E$2,Rates!$A$2:$J$2,0)+19,FALSE)","v":false},{"$f":"VLOOKUP(Calculator!$D$9,Rates!$A$3:$AB$17,MATCH(F$2,Rates!$A$2:$J$2,0)+19,FALSE)","v":false},{"$f":"VLOOKUP(Calculator!$D$9,Rates!$A$3:$AB$17,MATCH(G$2,Rates!$A$2:$J$2,0)+19,FALSE)","v":false},{"$f":"VLOOKUP(Calculator!$D$9,Rates!$A$3:$AB$17,MATCH(H$2,Rates!$A$2:$J$2,0)+19,FALSE)","v":false}]
[]
["Determined Bundled Charges (automated)"]
[{"$f":"A2","v":"Basic Residential (E-1)"},"All Usage","S Pk","S Pt","S Off","W Pk","W Pt","W Off","Meter Charge","Total"]
[{"$f":"A3","v":"Tier 1"},{"$f":"B3*C64","v":{"$error":"#DIV/0!"}},{"$error":"#DIV/0!"},{"$error":"#DIV/0!"},{"$error":"#DIV/0!"},{"$error":"#DIV/0!"},{"$error":"#DIV/0!"},{"$error":"#DIV/0!"},{"$f":"I3*Calculator!D15","v":0}]
[{"$f":"A4","v":"Tier 2"},{"$error":"#DIV/0!"},{"$error":"#DIV/0!"},{"$error":"#DIV/0!"},{"$error":"#DIV/0!"},{"$error":"#DIV/0!"},{"$error":"#DIV/0!"},{"$error":"#DIV/0!"}]
[{"$f":"A5","v":"Tier 3"},{"$error":"#DIV/0!"},{"$error":"#DIV/0!"},{"$error":"#DIV/0!"},{"$error":"#DIV/0!"},{"$error":"#DIV/0!"},{"$error":"#DIV/0!"},{"$error":"#DIV/0!"}]
["Total",{"$f":"SUM(B9:B11)","v":{"$error":"#DIV/0!"}},{"$error":"#DIV/0!"},{"$error":"#DIV/0!"},{"$error":"#DIV/0!"},{"$error":"#DIV/0!"},{"$error":"#DIV/0!"},{"$error":"#DIV/0!"},{"$f":"IFERROR(SUM(I9:I11),0)","v":0},{"$f":"SUM(B12:I12)","v":{"$error":"#DIV/0!"}}]
[]
["Determined Generation Rates (automated)"]
[{"$f":"A2","v":"Basic Residential (E-1)"},"All Usage","S Pk","S Pt","S Off","W Pk","W Pt","W Off","NEM Bonus"]
["PGE",{"$f":"VLOOKUP(Calculator!$D$9,Rates!$A$22:$H$36,MATCH(B$15,Rates!$A$2:$J$2,0),FALSE)","v":0.10780000000000001},{"$f":"VLOOKUP(Calculator!$D$9,Rates!$A$22:$H$36,MATCH(C$15,Rates!$A$2:$J$2,0),FALSE)","v":false},{"$f":"VLOOKUP(Calculator!$D$9,Rates!$A$22:$H$36,MATCH(D$15,Rates!$A$2:$J$2,0),FALSE)","v":false},{"$f":"VLOOKUP(Calculator!$D$9,Rates!$A$22:$H$36,MATCH(E$15,Rates!$A$2:$J$2,0),FALSE)","v":false},{"$f":"VLOOKUP(Calculator!$D$9,Rates!$A$22:$H$36,MATCH(F$15,Rates!$A$2:$J$2,0),FALSE)","v":false},{"$f":"VLOOKUP(Calculator!$D$9,Rates!$A$22:$H$36,MATCH(G$15,Rates!$A$2:$J$2,0),FALSE)","v":false},{"$f":"VLOOKUP(Calculator!$D$9,Rates!$A$22:$H$36,MATCH(H$15,Rates!$A$2:$J$2,0),FALSE)","v":false}]
["SVCE",{"$f":"VLOOKUP(Calculator!$D$9,Rates!$A$39:$H$53,MATCH(B$15,Rates!$A$2:$J$2,0),FALSE)","v":6.7320000000000005E-2},{"$f":"VLOOKUP(Calculator!$D$9,Rates!$A$39:$H$53,MATCH(C$15,Rates!$A$2:$J$2,0),FALSE)","v":false},{"$f":"VLOOKUP(Calculator!$D$9,Rates!$A$39:$H$53,MATCH(D$15,Rates!$A$2:$J$2,0),FALSE)","v":false},{"$f":"VLOOKUP(Calculator!$D$9,Rates!$A$39:$H$53,MATCH(E$15,Rates!$A$2:$J$2,0),FALSE)","v":false},{"$f":"VLOOKUP(Calculator!$D$9,Rates!$A$39:$H$53,MATCH(F$15,Rates!$A$2:$J$2,0),FALSE)","v":false},{"$f":"VLOOKUP(Calculator!$D$9,Rates!$A$39:$H$53,MATCH(G$15,Rates!$A$2:$J$2,0),FALSE)","v":false},{"$f":"VLOOKUP(Calculator!$D$9,Rates!$A$39:$H$53,MATCH(H$15,Rates!$A$2:$J$2,0),FALSE)","v":false},{"$f":"B69","v":8.0000000000000002E-3}]
[]
["Determined Generation Charges (automated)"]
[{"$f":"A2","v":"Basic Residential (E-1)"},"All Usage","S Pk","S Pt","S Off","W Pk","W Pt","W Off","NEM Bonus","Total"]
{"$rows_left_out":58}
{"sheet":"Rates","index":2,"n_rows":51,"n_cols":27,"rows_kept":51,"cut":false,"hidden":false,"merged":[]}
["Bundled Rate"]
["Tier 1","All Usage","S Pk","S Pt","S Off","W Pk","W Pt","W Off","Meter Charge","Minimum Bill","Tier 2","All Usage","S Pk","S Pt","S Off","W Pk","W Pt","W Off",null,"High Usage","All Usage","S Pk","S Pt","S Off","W Pk","W Pt","W Off"]
["Basic Residential (E-1)",0.21168999999999999,false,false,false,false,false,false,null,0.32854,{"$f":"A3","v":"Basic Residential (E-1)"},0.27993000000000001,false,false,false,false,false,false,null,{"$f":"K3","v":"Basic Residential (E-1)"},0.43342999999999998,false,false,false,false,false,false]
["Basic CARE Res. (EL-1)",0.13453000000000001,false,false,false,false,false,false,null,0.16427,{"$f":"A4","v":"Basic CARE Res. (EL-1)"},0.17766999999999999,false,false,false,false,false,false,null,"Basic CARE Res. (EL-1)",0.27510000000000001,false,false,false,false,false,false]
["E-TOU-A",{"$f":"L5","v":false},{"$f":"M5+D18","v":0.31398999999999999},{"$f":"N5","v":false},{"$f":"O5+D18","v":0.23842000000000002},{"$f":"P5+D18","v":0.19602000000000003},false,{"$f":"R5+D18","v":0.18173},null,{"$f":"J3","v":0.32854},{"$f":"A5","v":"E-TOU-A"},false,0.39979999999999999,false,0.32423000000000002,0.28183000000000002,false,0.26754,null,"E-TOU-A",false,0.39979999999999999,false,0.32423000000000002,0.28183000000000002,false,0.26754]
["E-TOU-B",{"$f":"L6","v":false},{"$f":"M6","v":0.37119000000000002},false,0.26812999999999998,0.23372000000000001,false,0.21492,null,{"$f":"J3","v":0.32854},"E-TOU-B",false,0.37119000000000002,false,0.26812999999999998,0.23372000000000001,false,0.21492,null,"E-TOU-B",false,0.37119000000000002,false,0.26812999999999998,0.23372000000000001,false,0.21492]
["E-TOU-C",{"$f":"L7","v":false},{"$f":"M7","v":0.37569000000000002},{"$f":"N7","v":false},{"$f":"O7","v":0.31225000000000003},{"$f":"P7","v":0.28860000000000002},{"$f":"Q7","v":false},{"$f":"R7","v":0.27127000000000001},null,0.32854,"E-TOU-C",false,0.37569000000000002,false,0.31225000000000003,0.28860000000000002,false,0.27127000000000001,null,"E-TOU-C"]
["EL-TOU-A (CARE)",{"$f":"L8","v":false},{"$f":"M8+D19","v":0.19623000000000002},false,{"$f":"O8+D19","v":0.14862000000000003},{"$f":"P8+D19","v":0.12191},false,{"$f":"R8+D19","v":0.11291},null,{"$f":"J4","v":0.16427},"EL-TOU-A (CARE)",false,0.2417,false,0.19409000000000001,0.16738,false,0.15837999999999999,null,"EL-TOU-A (CARE)",false,0.2417,false,0.19409000000000001,0.16738,false,0.15837999999999999]
["EL-TOU-B (CARE)",false,0.22788,false,0.16295999999999999,0.14127999999999999,false,0.12942999999999999,null,{"$f":"J4","v":0.16427},"EL-TOU-B (CARE)",false,0.22788,false,0.16295999999999999,0.14127999999999999,false,0.12942999999999999,null,"EL-TOU-B (CARE)",false,0.22788,false,0.16295999999999999,0.14127999999999999,false,0.12942999999999999]
["EV-A",false,0.47333999999999998,0.25994,0.12753,0.32987,0.20416999999999999,0.13045999999999999,null,{"$f":"J3","v":0.32854},"EV-A",false,0.47333999999999998,0.25994,0.12753,0.32987,0.20416999999999999,0.13045999999999999,null,"EV-A",false,0.47333999999999998,0.25994,0.12753,0.32987,0.20416999999999999,0.13045999999999999]
["EV-B",false,0.46665000000000001,0.25658999999999998,0.12705,0.32274000000000003,0.20061000000000001,0.12995000000000001,4.9279999999999997E-2,{"$f":"J3","v":0.32854},"EV-B",false,0.46665000000000001,0.25658999999999998,0.12705,0.32274000000000003,0.20061000000000001,0.12995000000000001,null,"EV-B",false,0.46665000000000001,0.25658999999999998,0.12705,0.32274000000000003,0.20061000000000001,0.12995000000000001]
[]
[{"$f":"\"--- Closed Rates ---\"","v":"--- Closed Rates ---"},null,null,null,null,null,null,null,null,null,{"$f":"A13","v":"--- Closed Rates ---"},null,null,null,null,null,null,null,null,{"$f":"K13","v":"--- Closed Rates ---"}]
["E-6 (Time-of-Use)",false,0.37123,0.25596000000000002,0.17918000000000001,false,0.20035,0.18351999999999999,0.25297999999999998,{"$f":"J3","v":0.32854},"E-6 (Time-of-Use)",false,0.45704,0.34177000000000002,0.26499,false,0.26478000000000002,0.24795,null,{"$f":"K14","v":"E-6 (Time-of-Use)"},false,{"$f":"M14","v":0.45704},{"$f":"N14","v":0.34177000000000002},0.26499,false,0.26478000000000002,0.24795]
["EL-6 (CARE, Time-of-Use)",false,0.25133,0.16683000000000001,0.11055,false,0.12606999999999999,0.11372,0.20238,{"$f":"J4","v":0.16427},"EL-6 (CARE, Time-of-Use)",false,0.29680000000000001,0.21229999999999999,0.15601999999999999,false,0.17154,0.15919,null,{"$f":"K15","v":"EL-6 (CARE, Time-of-Use)"},false,{"$f":"M15","v":0.29680000000000001},0.21229999999999999,0.15601999999999999,false,0.17154,0.15919]
[]
[]
["Baseline Credit (E-TOU only)",null,null,-8.5809999999999997E-2]
["Baseline Credit (EL-TOU only)",null,null,-4.5469999999999997E-2]
[]
{"$rows_left_out":32}
{"sheet":"Rebundled Rates","index":3,"n_rows":51,"n_cols":14,"rows_kept":51,"cut":false,"hidden":true,"merged":[[42,0,42,13],[43,3,43,6],[43,10,43,13],[20,10,20,13],[20,3,20,6],[26,3,26,6],[26,10,26,13],[34,3,34,6],[34,10,34,13],[1,3,1,6],[0,1,0,6],[0,8,0,13],[1,10,1,13],[6,3,6,6],[6,10,6,13]]}
[null,"Rates for Usage",null,null,null,null,null,null,"Rates for Surplus Generation (Excess NEM Credits at billing date)"]
[{"$f":"Rates!A3","v":"Basic Residential (E-1)"},"MCE Rebundled","PG&E Bundled","Result",null,null,null,null,"MCE Rebundled","PG&E Bundled","Result"]
["Up to Baseline",{"$f":"C3-VLOOKUP($A$2,Rates!$A$21:$H$35,2,0)+VLOOKUP($A$2,Rates!$A$38:$H$52,2,0)+VLOOKUP(MAX('Data & Calculations'!$A$35:$A$46),'Data & Calculations'!$A$35:$D$46,4,0)","v":0.20521999999999996},{"$f":"VLOOKUP(A$2,Rates!$A$2:$AB$19,2,0)","v":0.21168999999999999},"MCE's rate is",{"$f":"IF(B3<C3,\"lower by\",\"higher by\")","v":"lower by"},{"$f":"ABS(C3-B3)","v":6.4700000000000313E-3},"per kWh",null,{"$f":"B3+0.01","v":0.21521999999999997},{"$f":"C3","v":0.21168999999999999},"MCE's rate is",{"$f":"IF(I3<J3,\"lower by\",\"higher by\")","v":"higher by"},{"$f":"ABS(J3-I3)","v":3.5299999999999776E-3},"per kWh"]
["100%-200% of Baseline",{"$f":"C4-VLOOKUP($A$2,Rates!$A$21:$H$35,2,0)+VLOOKUP($A$2,Rates!$A$38:$H$52,2,0)+VLOOKUP(MAX('Data & Calculations'!$A$35:$A$46),'Data & Calculations'!$A$35:$D$46,4,0)","v":0.27345999999999998},{"$f":"VLOOKUP(A$2,Rates!$A$2:$AB$19,12,0)","v":0.27993000000000001},"MCE's rate is",{"$f":"IF(B4<C4,\"lower by\",\"higher by\")","v":"lower by"},{"$f":"ABS(C4-B4)","v":6.4700000000000313E-3},"per kWh",null,{"$f":"B4+0.01","v":0.28345999999999999},{"$f":"C4","v":0.27993000000000001},"MCE's rate is",{"$f":"IF(I4<J4,\"lower by\",\"higher by\")","v":"higher by"},{"$f":"ABS(J4-I4)","v":3.5299999999999776E-3},"per kWh"]
["Over 200% of Baseline",{"$f":"C5-VLOOKUP($A$2,Rates!$A$21:$H$35,2,0)+VLOOKUP($A$2,Rates!$A$38:$H$52,2,0)+VLOOKUP(MAX('Data & Calculations'!$A$35:$A$46),'Data & Calculations'!$A$35:$D$46,4,0)","v":0.42695999999999995},{"$f":"VLOOKUP(A$2,Rates!$A$2:$AB$19,21,0)","v":0.43342999999999998},"MCE's rate is","lower by",6.4700000000000313E-3,"per kWh",null,0.43695999999999996,0.43342999999999998,"MCE's rate is","higher by",3.5299999999999776E-3,"per kWh"]
[]
[{"$f":"Rates!A5","v":"E-TOU-A"},"MCE Rebundled","PG&E Bundled","Result",null,null,null,null,"MCE Rebundled","PG&E Bundled","Result"]
["Summer Peak"]
["… up to Baseline",{"$f":"C9-VLOOKUP($A$7,Rates!$A$21:$H$35,3,0)+VLOOKUP($A$7,Rates!$A$38:$H$52,3,0)+VLOOKUP(MAX('Data & Calculations'!$A$35:$A$46),'Data & Calculations'!$A$35:$D$46,4,0)","v":0.30255999999999994},{"$f":"VLOOKUP(A$7,Rates!$A$2:$AB$19,3,0)","v":0.31398999999999999},"MCE's rate is",{"$f":"IF(B9<C9,\"lower by\",\"higher by\")","v":"lower by"},{"$f":"ABS(C9-B9)","v":1.1430000000000051E-2},"per kWh",null,{"$f":"B9+0.01","v":0.31255999999999995},{"$f":"C9","v":0.31398999999999999},"MCE's rate is",{"$f":"IF(I9<J9,\"lower by\",\"higher by\")","v":"lower by"},{"$f":"ABS(J9-I9)","v":1.4300000000000423E-3},"per kWh"]
["… above Baseline",{"$f":"C10-VLOOKUP($A$7,Rates!$A$21:$H$35,3,0)+VLOOKUP($A$7,Rates!$A$38:$H$52,3,0)+VLOOKUP(MAX('Data & Calculations'!$A$35:$A$46),'Data & Calculations'!$A$35:$D$46,4,0)","v":0.38836999999999999},{"$f":"VLOOKUP(A$7,Rates!$A$2:$AB$19,13,0)","v":0.39979999999999999},"MCE's rate is","lower by",1.1429999999999996E-2,"per kWh",null,{"$f":"B10+0.01","v":0.39837},{"$f":"C10","v":0.39979999999999999},"MCE's rate is","lower by",1.4299999999999868E-3,"per kWh"]
["Summer Off Peak"]
["… up to Baseline",{"$f":"C12-VLOOKUP($A$7,Rates!$A$21:$H$35,5,0)+VLOOKUP($A$7,Rates!$A$38:$H$52,5,0)+VLOOKUP(MAX('Data & Calculations'!$A$35:$A$46),'Data & Calculations'!$A$35:$D$46,4,0)","v":0.23152},{"$f":"VLOOKUP(A$7,Rates!$A$2:$AB$19,5,0)","v":0.23842000000000002},"MCE's rate is",{"$f":"IF(B12<C12,\"lower by\",\"higher by\")","v":"lower by"},{"$f":"ABS(C12-B12)","v":6.9000000000000172E-3},"per kWh",null,{"$f":"B12+0.01","v":0.24152000000000001},{"$f":"C12","v":0.23842000000000002},"MCE's rate is","higher by",3.0999999999999917E-3,"per kWh"]
["… above Baseline",{"$f":"C13-VLOOKUP($A$7,Rates!$A$21:$H$35,5,0)+VLOOKUP($A$7,Rates!$A$38:$H$52,5,0)+VLOOKUP(MAX('Data & Calculations'!$A$35:$A$46),'Data & Calculations'!$A$35:$D$46,4,0)","v":0.31733},{"$f":"VLOOKUP(A$7,Rates!$A$2:$AB$19,15,0)","v":0.32423000000000002},"MCE's rate is","lower by",6.9000000000000172E-3,"per kWh",null,{"$f":"B13+0.01","v":0.32733000000000001},{"$f":"C13","v":0.32423000000000002},"MCE's rate is","higher by",3.0999999999999917E-3,"per kWh"]
["Winter Peak"]
["… up to Baseline",{"$f":"C15-VLOOKUP($A$7,Rates!$A$21:$H$35,6,0)+VLOOKUP($A$7,Rates!$A$38:$H$52,6,0)+VLOOKUP(MAX('Data & Calculations'!$A$35:$A$46),'Data & Calculations'!$A$35:$D$46,4,0)","v":0.18983},{"$f":"VLOOKUP(A$7,Rates!$A$2:$AB$19,6,0)","v":0.19602000000000003},"MCE's rate is","lower by",6.1900000000000288E-3,"per kWh",null,{"$f":"B15+0.01","v":0.19983000000000001},{"$f":"C15","v":0.19602000000000003},"MCE's rate is","higher by",3.8099999999999801E-3,"per kWh"]
["… above Baseline",{"$f":"C16-VLOOKUP($A$7,Rates!$A$21:$H$35,6,0)+VLOOKUP($A$7,Rates!$A$38:$H$52,6,0)+VLOOKUP(MAX('Data & Calculations'!$A$35:$A$46),'Data & Calculations'!$A$35:$D$46,4,0)","v":0.27564},{"$f":"VLOOKUP(A$7,Rates!$A$2:$AB$19,16,0)","v":0.28183000000000002},"MCE's rate is","lower by",6.1900000000000288E-3,"per kWh",null,{"$f":"B16+0.01","v":0.28564000000000001},{"$f":"C16","v":0.28183000000000002},"MCE's rate is","higher by",3.8099999999999801E-3,"per kWh"]
["Winter Off Peak"]
["… up to Baseline",{"$f":"C18-VLOOKUP($A$7,Rates!$A$21:$H$35,8,0)+VLOOKUP($A$7,Rates!$A$38:$H$52,8,0)+VLOOKUP(MAX('Data & Calculations'!$A$35:$A$46),'Data & Calculations'!$A$35:$D$46,4,0)","v":0.1764},{"$f":"VLOOKUP(A$7,Rates!$A$2:$AB$19,8,0)","v":0.18173},"MCE's rate is","lower by",5.3300000000000014E-3,"per kWh",null,{"$f":"B18+0.01","v":0.18640000000000001},{"$f":"C18","v":0.18173},"MCE's rate is","higher by",4.6700000000000075E-3,"per kWh"]
["… above Baseline",{"$f":"C19-VLOOKUP($A$7,Rates!$A$21:$H$35,8,0)+VLOOKUP($A$7,Rates!$A$38:$H$52,8,0)+VLOOKUP(MAX('Data & Calculations'!$A$35:$A$46),'Data & Calculations'!$A$35:$D$46,4,0)","v":0.26221},{"$f":"VLOOKUP(A$7,Rates!$A$2:$AB$19,18,0)","v":0.26754},"MCE's rate is","lower by",5.3300000000000014E-3,"per kWh",null,{"$f":"B19+0.01","v":0.27221000000000001},{"$f":"C19","v":0.26754},"MCE's rate is","higher by",4.6700000000000075E-3,"per kWh"]
[]
{"$rows_left_out":32}
{"sheet":"Changelog","index":4,"n_rows":11,"n_cols":2,"rows_kept":11,"cut":false,"hidden":true,"merged":[]}
["Date","Change"]
["2016-04-29","Beta version completed, to staff for review."]
["2016-05-04","Cosmetic Changes"]
[null,"Corrected EV rate description"]
[null,"Hid and locked cell editing for public use to restrict potentially breaking calculations"]
["2016-05-23","Replaced IFNA command with IFERROR; IFNA is not well supported in Excel. May need to replace with IF(ISERROR()) later."]
["2016-11-15","Rebundled Rates Added"]
["2017-01-03","Updated for PG&E AET"]
["2017-03-01","Changes for PG&E 3/1 change (tiers, etc)"]
[null,"Updated Local Sol implementation date"]
[null,"Added MCE 4/1 Rates"]