{"text_format":"1","workbook":"xlsx","n_sheets":7,"sheets":["Cost Comparison","Calculation","Rates","PCIA  FF","CARE","Rebundled Rates","Changelog"],"not_rendered":{"charts":0,"images":1,"macros":1,"external_links":0,"defined_names":1,"comments":1,"pivot_tables":0},"unopened":[],"bounds":{"document_bytes":16777216,"sheet_cells":100000,"rows_first":2000,"rows_last":500,"rows_between":2000,"halvings":0,"cell_chars":16384,"cell_head_chars":4096},"cells_cut":0,"cells_raw":0,"read":"whole","date_system":"1900"}

{"sheet":"Cost Comparison","index":0,"n_rows":64,"n_cols":20,"rows_kept":64,"cut":false,"hidden":false,"merged":[[34,13,36,19],[45,1,46,15]]}
[]
[null,"SVCE Business Cost Comparison Calculator",null,null,null,null,null,null,null,null,null,null,null,null,null,null,null,null,null,"Effective 4/1/2018"]
[]
[null,"Required Information",null,null,null,null,null,null,null,null,null,null,null,"Optional Information"]
[null,"Your Rate"]
[null,"A1 (COM-1)"]
[]
[null,"Your Usage"]
[null,null,null,null,null,null,null,"SUMMER",null,null,null,"WINTER"]
[null,{"$f":"IF(VLOOKUP(B6,Rates!A:AA,2,0)=FALSE,\"\",\"One Month of Usage:\")","v":""},null,null,null,"Summer Billing Period (days):",null,null,null," Winter Billing Period (days):"]
{"$rows_left_out":55}
{"sheet":"Calculation","index":1,"n_rows":44,"n_cols":8,"rows_kept":44,"cut":false,"hidden":true,"merged":[]}
["Normalized PCIA",{"$f":"'Cost Comparison'!R11","v":2017},null,null,null,null,"PCIA Charge",{"$f":"IFERROR(B2*E3,0)","v":0}]
["PCIA Rate",{"$f":"VLOOKUP(E2,'PCIA  FF'!A2:U12,MATCH(B1,'PCIA  FF'!1:1,0),FALSE)","v":2.4660000000000001E-2},null,"PCIA Class",{"$f":"VLOOKUP('Cost Comparison'!B6,Rates!$A$70:$S$98,19,0)","v":"A1"}]
["FF Rate",{"$f":"IF('Cost Comparison'!$R$12=\"No\",VLOOKUP(E2,'PCIA  FF'!A14:U24,MATCH(B1,'PCIA  FF'!14:14,0),FALSE),0)","v":6.2E-4},null,"Usage Eligible",{"$f":"SUMIF(C7:C15,\"<>FALSE\",B7:B15)","v":0},null,"FF Charge",{"$f":"E3*B3","v":0}]
[]
["Bundled Rate Components"]
[null,"kWh/KW","Bundled Rate","Bundled Charge","PG&E Gen Rate","PG&E Gen Charge","SVCEA Gen Rate","SVCEA Gen Charge"]
["Non-sea/non-tou",{"$f":"'Cost Comparison'!D10","v":0},{"$f":"VLOOKUP('Cost Comparison'!$B$6,Rates!$A$2:$W$31,2,0)","v":false},{"$f":"B7*C7","v":0},{"$f":"VLOOKUP('Cost Comparison'!$B$6,Rates!$A$36:$W$67,2,0)","v":false},{"$f":"B7*E7","v":0},{"$f":"VLOOKUP('Cost Comparison'!$B$6,Rates!$A$69:$W$100,2,0)","v":false},{"$f":"G7*B7","v":0}]
["Summer seasonal",{"$f":"'Cost Comparison'!H11","v":0},{"$f":"VLOOKUP('Cost Comparison'!$B$6,Rates!$A$2:$W$31,3,0)","v":0.25385999999999997},0,{"$f":"VLOOKUP('Cost Comparison'!$B$6,Rates!$A$36:$W$67,3,0)","v":0.12570000000000001},0,{"$f":"VLOOKUP('Cost Comparison'!$B$6,Rates!$A$69:$W$100,3,0)","v":9.2880000000000004E-2},0]
["Winter Seasonal",{"$f":"'Cost Comparison'!L11","v":0},{"$f":"VLOOKUP('Cost Comparison'!$B$6,Rates!$A$2:$W$31,4,0)","v":0.19670000000000001},0,{"$f":"VLOOKUP('Cost Comparison'!$B$6,Rates!$A$36:$W$67,4,0)","v":8.6480000000000001E-2},0,{"$f":"VLOOKUP('Cost Comparison'!$B$6,Rates!$A$69:$W$100,4,0)","v":5.6009999999999997E-2},0]
["Summer Peak",{"$f":"'Cost Comparison'!H15","v":0},{"$f":"VLOOKUP('Cost Comparison'!$B$6,Rates!$A$2:$W$31,5,0)","v":false},0,{"$f":"VLOOKUP('Cost Comparison'!$B$6,Rates!$A$36:$W$67,5,0)","v":false},0,{"$f":"VLOOKUP('Cost Comparison'!$B$6,Rates!$A$69:$W$100,5,0)","v":false},0]
{"$rows_left_out":35}
{"sheet":"Rates","index":2,"n_rows":98,"n_cols":22,"rows_kept":98,"cut":false,"hidden":true,"merged":[]}
["Bundled Charges",null,"Flat Rate Options",null,"TOU Rate Options",null,null,null,null,null,"Demand Charges",null,null,null,null,null,null,null,"Per Meter/Day"]
["Rate Schedules","All Usage","Summer","Winter","Summer Peak","Summer Partial Peak","Summer Off Peak","Winter Peak","Winter Partial Peak","Winter Off Peak","Summer Peak","Summer Partial Peak","Summer Maximum","Winter Off Peak","Winter Partial","Winter Maximum","Conn. Load Sum.","Conn. Load Win.","Single-phase","Poly-phase","Voluntary","Mandatory"]
["A1 (COM-1)",false,0.25385999999999997,0.19670000000000001,false,false,false,false,false,false,false,false,false,false,false,false,false,false,0.32854,0.65708,false,false]
["A1X (COM-1 TOU)",false,false,false,0.26800000000000002,0.24435000000000001,0.217,false,0.22622,0.20530000000000001,false,false,false,false,false,false,false,false,{"$f":"S3","v":0.32854},{"$f":"T3","v":0.65708},false,false]
["A6 (COM-6)",false,false,false,0.56477999999999995,0.26795999999999998,0.19636999999999999,false,0.21389,0.19564999999999999,false,false,false,false,false,false,false,false,{"$f":"S3","v":0.32854},{"$f":"T3","v":0.65708},false,false]
["A10A (COM-10)",false,0.16949,0.13075000000000001,false,false,false,false,false,false,false,false,19.52,false,false,11.76,false,false,4.5995900000000001,{"$f":"S6","v":4.5995900000000001},false,false]
["A10B (COM-10-TOU)",false,false,false,0.22337000000000001,0.16824,0.14016999999999999,false,0.14054,0.12347,false,false,{"$f":"M6","v":19.52},false,false,{"$f":"P6","v":11.76},false,false,{"$f":"S6","v":4.5995900000000001},{"$f":"T6","v":4.5995900000000001},false,false]
["E19S (COM-19S)",false,false,false,0.16055,0.11613,8.6709999999999995E-2,false,0.11004,9.4009999999999996E-2,19.649999999999999,5.4,17.739999999999998,false,0.12,17.739999999999998,false,false,false,false,{"$f":"S6","v":4.5995900000000001},19.712530000000001]
["E19P (COM-19P)",false,false,false,0.14943999999999999,0.10739,8.0360000000000001E-2,false,0.10170999999999999,8.7040000000000006E-2,17.489999999999998,4.72,14.7,false,0.14000000000000001,14.7,false,false,false,false,{"$f":"U8","v":4.5995900000000001},{"$f":"V8","v":19.712530000000001}]
["E19T (COM-19T)",false,false,false,0.11286,9.8589999999999997E-2,7.9699999999999993E-2,false,0.10083,8.6319999999999994E-2,14.06,3.53,9.56,false,0,9.56,false,false,false,false,{"$f":"U7","v":false},{"$f":"V7","v":false}]
{"$rows_left_out":89}
{"sheet":"PCIA  FF","index":3,"n_rows":36,"n_cols":16,"rows_kept":36,"cut":false,"hidden":true,"merged":[]}
["PCIA",null,2009,2010,2011,2012,2013,2014,2015,2016,2017,2018,null,null,"Error-checking and debugging:"]
["Residential",null,null,null,null,null,null,null,null,null,null,null,null,null,"Min","Max"]
["A1",null,2.053E-2,2.3349999999999999E-2,2.4230000000000002E-2,2.4910000000000002E-2,2.4969999999999999E-2,2.4719999999999999E-2,2.46E-2,2.4660000000000001E-2,{"$f":"J3","v":2.4660000000000001E-2},{"$f":"J3","v":2.4660000000000001E-2},null,null,{"$f":"MIN(C3:K3)","v":2.053E-2},{"$f":"MAX(C3:K3)","v":2.4969999999999999E-2}]
["A10",null,2.0820000000000002E-2,2.368E-2,2.4570000000000002E-2,2.5260000000000001E-2,2.5329999999999998E-2,2.5080000000000002E-2,2.496E-2,2.5010000000000001E-2,2.5020000000000001E-2,{"$f":"K4","v":2.5020000000000001E-2},null,null,{"$f":"MIN(C4:K4)","v":2.0820000000000002E-2},{"$f":"MAX(C4:K4)","v":2.5329999999999998E-2}]
["E19",null,1.7520000000000001E-2,1.992E-2,2.0670000000000001E-2,2.1250000000000002E-2,2.1309999999999999E-2,2.1090000000000001E-2,2.0990000000000002E-2,2.104E-2,{"$f":"J5","v":2.104E-2},{"$f":"J5","v":2.104E-2},null,null,1.7520000000000001E-2,2.1309999999999999E-2]
["Streelights",null,4.9100000000000003E-3,5.5799999999999999E-3,5.79E-3,5.9500000000000004E-3,5.9699999999999996E-3,5.9100000000000003E-3,5.8799999999999998E-3,5.8900000000000003E-3,{"$f":"J6","v":5.8900000000000003E-3},{"$f":"J6","v":5.8900000000000003E-3},null,null,4.9100000000000003E-3,5.9699999999999996E-3]
["Standby",null,9.9600000000000001E-3,1.132E-2,1.175E-2,1.208E-2,1.2109999999999999E-2,1.1990000000000001E-2,1.193E-2,1.196E-2,{"$f":"J7","v":1.196E-2},{"$f":"J7","v":1.196E-2},null,null,9.9600000000000001E-3,1.2109999999999999E-2]
["Agriculture",null,2.051E-2,2.332E-2,2.4199999999999999E-2,2.4879999999999999E-2,2.494E-2,2.47E-2,2.4570000000000002E-2,2.4629999999999999E-2,2.4629999999999999E-2,2.4629999999999999E-2,null,null,2.051E-2,2.494E-2]
["E20T",null,1.4449999999999999E-2,1.643E-2,1.704E-2,1.7520000000000001E-2,1.7569999999999999E-2,1.7399999999999999E-2,1.7309999999999999E-2,1.7350000000000001E-2,{"$f":"J9","v":1.7350000000000001E-2},{"$f":"J9","v":1.7350000000000001E-2},null,null,1.4449999999999999E-2,1.7569999999999999E-2]
["E20P",null,1.5720000000000001E-2,1.787E-2,1.8540000000000001E-2,1.9060000000000001E-2,1.9109999999999999E-2,1.8919999999999999E-2,1.883E-2,1.8870000000000001E-2,1.8880000000000001E-2,{"$f":"K10","v":1.8880000000000001E-2},null,null,1.5720000000000001E-2,1.9109999999999999E-2]
{"$rows_left_out":27}
{"sheet":"CARE","index":4,"n_rows":7,"n_cols":7,"rows_kept":7,"cut":false,"hidden":true,"merged":[]}
["Commercial Care Discounts",null,null,null,null,"CARE Ind?",{"$f":"'Cost Comparison'!R14","v":"No"}]
[null,null,"Usage","Discount",null,"Eligible Usage",{"$f":"Calculation!E3","v":0}]
["A1",7.8939999999999996E-2,{"$f":"IF(AND($G$1=\"Yes\",Calculation!$E$2=CARE!$A3,'Cost Comparison'!B6<>\"TC-1\"),Calculation!$E$3,0)","v":0},{"$f":"B3*C3","v":0}]
["A6",7.6280000000000001E-2,{"$f":"IF(AND($G$1=\"Yes\",Calculation!$E$2=CARE!$A4),Calculation!$E$3,0)","v":0},{"$f":"B4*C4","v":0}]
["A10",7.0660000000000001E-2,{"$f":"IF(AND($G$1=\"Yes\",Calculation!$E$2=CARE!$A5),Calculation!$E$3,0)","v":0},{"$f":"B5*C5","v":0}]
["E19",6.2619999999999995E-2,{"$f":"IF(AND($G$1=\"Yes\",Calculation!$E$2=CARE!$A6),Calculation!$E$3,0)","v":0},{"$f":"B6*C6","v":0}]
["E20",5.1450000000000003E-2,{"$f":"IF(AND($G$1=\"Yes\",Calculation!$E$2=CARE!$A7),Calculation!$E$3,0)","v":0},0]

{"sheet":"Rebundled Rates","index":5,"n_rows":20,"n_cols":8,"rows_kept":20,"cut":false,"hidden":true,"merged":[[1,2,1,5]]}
[]
[null,"A1X (COM-1 TOU)","MCE",null,null,null,"PG&E","Overall"]
[null,"Season","MCE Gen.","PG&E Delivery","PG&E Fees","Effective Rate","PG&E Rate","% Diff."]
["Non-Seasonal","All Usage",{"$f":"IF(INDEX(Rates!$A$69:$J$100,MATCH($B$2,Rates!$A$69:$A$100,0),MATCH('Rebundled Rates'!B4,Rates!$2:$2,0))=FALSE,\"\",INDEX(Rates!$A$69:$J$100,MATCH($B$2,Rates!$A$69:$A$100,0),MATCH('Rebundled Rates'!B4,Rates!$2:$2,0)))","v":""},{"$f":"IF(INDEX(Rates!$A$36:$J$65,MATCH('Rebundled Rates'!$B$2,Rates!$A$2:$A$33,0),MATCH('Rebundled Rates'!B4,Rates!$2:$2,0))=FALSE,\"\",G4-INDEX(Rates!$A$36:$J$65,MATCH('Rebundled Rates'!$B$2,Rates!$A$2:$A$33,0),MATCH('Rebundled Rates'!B4,Rates!$2:$2,0)))","v":""},{"$f":"IF(C4=\"\",\"\",VLOOKUP(VLOOKUP($B$2,Rates!$A$68:$S$100,19,0),'PCIA  FF'!$A:$P,MATCH(MAX('PCIA  FF'!$1:$1),'PCIA  FF'!$1:$1,0),0)+VLOOKUP(VLOOKUP($B$2,Rates!$A$68:$S$100,19,0),'PCIA  FF'!$14:$24,MATCH(MAX('PCIA  FF'!$1:$1),'PCIA  FF'!$1:$1,0),0))","v":""},{"$f":"IF(SUM(C4:E4)=0,\"\",SUM(C4:E4))","v":""},{"$f":"IF(INDEX(Rates!$A$2:$J$33,MATCH('Rebundled Rates'!$B$2,Rates!$A$2:$A$33,0),MATCH('Rebundled Rates'!B4,Rates!$2:$2,0))=FALSE,\"\",INDEX(Rates!$A$2:$J$33,MATCH('Rebundled Rates'!$B$2,Rates!$A$2:$A$33,0),MATCH('Rebundled Rates'!B4,Rates!$2:$2,0)))","v":""},{"$f":"IFERROR((F4/G4)-1,\"\")","v":""}]
["Non-TOU",{"$f":"Rates!C2","v":"Summer"},{"$f":"IF(INDEX(Rates!$A$69:$J$100,MATCH($B$2,Rates!$A$69:$A$100,0),MATCH('Rebundled Rates'!B5,Rates!$2:$2,0))=FALSE,\"\",INDEX(Rates!$A$69:$J$100,MATCH($B$2,Rates!$A$69:$A$100,0),MATCH('Rebundled Rates'!B5,Rates!$2:$2,0)))","v":""},{"$f":"IF(INDEX(Rates!$A$36:$J$65,MATCH('Rebundled Rates'!$B$2,Rates!$A$2:$A$33,0),MATCH('Rebundled Rates'!B5,Rates!$2:$2,0))=FALSE,\"\",G5-INDEX(Rates!$A$36:$J$65,MATCH('Rebundled Rates'!$B$2,Rates!$A$2:$A$33,0),MATCH('Rebundled Rates'!B5,Rates!$2:$2,0)))","v":""},{"$f":"IF(C5=\"\",\"\",VLOOKUP(VLOOKUP($B$2,Rates!$A$68:$S$100,19,0),'PCIA  FF'!$A:$P,MATCH(MAX('PCIA  FF'!$1:$1),'PCIA  FF'!$1:$1,0),0)+VLOOKUP(VLOOKUP($B$2,Rates!$A$68:$S$100,19,0),'PCIA  FF'!$14:$24,MATCH(MAX('PCIA  FF'!$1:$1),'PCIA  FF'!$1:$1,0),0))","v":""},{"$f":"IF(SUM(C5:E5)=0,\"\",SUM(C5:E5))","v":""},{"$f":"IF(INDEX(Rates!$A$2:$J$33,MATCH('Rebundled Rates'!$B$2,Rates!$A$2:$A$33,0),MATCH('Rebundled Rates'!B5,Rates!$2:$2,0))=FALSE,\"\",INDEX(Rates!$A$2:$J$33,MATCH('Rebundled Rates'!$B$2,Rates!$A$2:$A$33,0),MATCH('Rebundled Rates'!B5,Rates!$2:$2,0)))","v":""},{"$f":"IFERROR((F5/G5)-1,\"\")","v":""}]
["Non-TOU",{"$f":"Rates!D2","v":"Winter"},{"$f":"IF(INDEX(Rates!$A$69:$J$100,MATCH($B$2,Rates!$A$69:$A$100,0),MATCH('Rebundled Rates'!B6,Rates!$2:$2,0))=FALSE,\"\",INDEX(Rates!$A$69:$J$100,MATCH($B$2,Rates!$A$69:$A$100,0),MATCH('Rebundled Rates'!B6,Rates!$2:$2,0)))","v":""},{"$f":"IF(INDEX(Rates!$A$36:$J$65,MATCH('Rebundled Rates'!$B$2,Rates!$A$2:$A$33,0),MATCH('Rebundled Rates'!B6,Rates!$2:$2,0))=FALSE,\"\",G6-INDEX(Rates!$A$36:$J$65,MATCH('Rebundled Rates'!$B$2,Rates!$A$2:$A$33,0),MATCH('Rebundled Rates'!B6,Rates!$2:$2,0)))","v":""},{"$f":"IF(C6=\"\",\"\",VLOOKUP(VLOOKUP($B$2,Rates!$A$68:$S$100,19,0),'PCIA  FF'!$A:$P,MATCH(MAX('PCIA  FF'!$1:$1),'PCIA  FF'!$1:$1,0),0)+VLOOKUP(VLOOKUP($B$2,Rates!$A$68:$S$100,19,0),'PCIA  FF'!$14:$24,MATCH(MAX('PCIA  FF'!$1:$1),'PCIA  FF'!$1:$1,0),0))","v":""},"",{"$f":"IF(INDEX(Rates!$A$2:$J$33,MATCH('Rebundled Rates'!$B$2,Rates!$A$2:$A$33,0),MATCH('Rebundled Rates'!B6,Rates!$2:$2,0))=FALSE,\"\",INDEX(Rates!$A$2:$J$33,MATCH('Rebundled Rates'!$B$2,Rates!$A$2:$A$33,0),MATCH('Rebundled Rates'!B6,Rates!$2:$2,0)))","v":""},""]
["TOU Usage",{"$f":"Rates!E2","v":"Summer Peak"},{"$f":"IF(INDEX(Rates!$A$69:$J$100,MATCH($B$2,Rates!$A$69:$A$100,0),MATCH('Rebundled Rates'!B7,Rates!$2:$2,0))=FALSE,\"\",INDEX(Rates!$A$69:$J$100,MATCH($B$2,Rates!$A$69:$A$100,0),MATCH('Rebundled Rates'!B7,Rates!$2:$2,0)))","v":0.10617},{"$f":"IF(INDEX(Rates!$A$36:$J$65,MATCH('Rebundled Rates'!$B$2,Rates!$A$2:$A$33,0),MATCH('Rebundled Rates'!B7,Rates!$2:$2,0))=FALSE,\"\",G7-INDEX(Rates!$A$36:$J$65,MATCH('Rebundled Rates'!$B$2,Rates!$A$2:$A$33,0),MATCH('Rebundled Rates'!B7,Rates!$2:$2,0)))","v":0.12816000000000002},{"$f":"IF(C7=\"\",\"\",VLOOKUP(VLOOKUP($B$2,Rates!$A$68:$S$100,19,0),'PCIA  FF'!$A:$P,MATCH(MAX('PCIA  FF'!$1:$1),'PCIA  FF'!$1:$1,0),0)+VLOOKUP(VLOOKUP($B$2,Rates!$A$68:$S$100,19,0),'PCIA  FF'!$14:$24,MATCH(MAX('PCIA  FF'!$1:$1),'PCIA  FF'!$1:$1,0),0))","v":2.528E-2},{"$f":"IF(SUM(C7:E7)=0,\"\",SUM(C7:E7))","v":0.25961000000000006},{"$f":"IF(INDEX(Rates!$A$2:$J$33,MATCH('Rebundled Rates'!$B$2,Rates!$A$2:$A$33,0),MATCH('Rebundled Rates'!B7,Rates!$2:$2,0))=FALSE,\"\",INDEX(Rates!$A$2:$J$33,MATCH('Rebundled Rates'!$B$2,Rates!$A$2:$A$33,0),MATCH('Rebundled Rates'!B7,Rates!$2:$2,0)))","v":0.26800000000000002},{"$f":"IFERROR((F7/G7)-1,\"\")","v":-3.1305970149253515E-2}]
["TOU Usage",{"$f":"Rates!F2","v":"Summer Partial Peak"},{"$f":"IF(INDEX(Rates!$A$69:$J$100,MATCH($B$2,Rates!$A$69:$A$100,0),MATCH('Rebundled Rates'!B8,Rates!$2:$2,0))=FALSE,\"\",INDEX(Rates!$A$69:$J$100,MATCH($B$2,Rates!$A$69:$A$100,0),MATCH('Rebundled Rates'!B8,Rates!$2:$2,0)))","v":8.3940000000000001E-2},{"$f":"IF(INDEX(Rates!$A$36:$J$65,MATCH('Rebundled Rates'!$B$2,Rates!$A$2:$A$33,0),MATCH('Rebundled Rates'!B8,Rates!$2:$2,0))=FALSE,\"\",G8-INDEX(Rates!$A$36:$J$65,MATCH('Rebundled Rates'!$B$2,Rates!$A$2:$A$33,0),MATCH('Rebundled Rates'!B8,Rates!$2:$2,0)))","v":0.12816},{"$f":"IF(C8=\"\",\"\",VLOOKUP(VLOOKUP($B$2,Rates!$A$68:$S$100,19,0),'PCIA  FF'!$A:$P,MATCH(MAX('PCIA  FF'!$1:$1),'PCIA  FF'!$1:$1,0),0)+VLOOKUP(VLOOKUP($B$2,Rates!$A$68:$S$100,19,0),'PCIA  FF'!$14:$24,MATCH(MAX('PCIA  FF'!$1:$1),'PCIA  FF'!$1:$1,0),0))","v":2.528E-2},{"$f":"IF(SUM(C8:E8)=0,\"\",SUM(C8:E8))","v":0.23738000000000001},{"$f":"IF(INDEX(Rates!$A$2:$J$33,MATCH('Rebundled Rates'!$B$2,Rates!$A$2:$A$33,0),MATCH('Rebundled Rates'!B8,Rates!$2:$2,0))=FALSE,\"\",INDEX(Rates!$A$2:$J$33,MATCH('Rebundled Rates'!$B$2,Rates!$A$2:$A$33,0),MATCH('Rebundled Rates'!B8,Rates!$2:$2,0)))","v":0.24435000000000001},{"$f":"IFERROR((F8/G8)-1,\"\")","v":-2.8524657253939045E-2}]
["TOU Usage",{"$f":"Rates!G2","v":"Summer Off Peak"},{"$f":"IF(INDEX(Rates!$A$69:$J$100,MATCH($B$2,Rates!$A$69:$A$100,0),MATCH('Rebundled Rates'!B9,Rates!$2:$2,0))=FALSE,\"\",INDEX(Rates!$A$69:$J$100,MATCH($B$2,Rates!$A$69:$A$100,0),MATCH('Rebundled Rates'!B9,Rates!$2:$2,0)))","v":5.8229999999999997E-2},{"$f":"IF(INDEX(Rates!$A$36:$J$65,MATCH('Rebundled Rates'!$B$2,Rates!$A$2:$A$33,0),MATCH('Rebundled Rates'!B9,Rates!$2:$2,0))=FALSE,\"\",G9-INDEX(Rates!$A$36:$J$65,MATCH('Rebundled Rates'!$B$2,Rates!$A$2:$A$33,0),MATCH('Rebundled Rates'!B9,Rates!$2:$2,0)))","v":0.12816},{"$f":"IF(C9=\"\",\"\",VLOOKUP(VLOOKUP($B$2,Rates!$A$68:$S$100,19,0),'PCIA  FF'!$A:$P,MATCH(MAX('PCIA  FF'!$1:$1),'PCIA  FF'!$1:$1,0),0)+VLOOKUP(VLOOKUP($B$2,Rates!$A$68:$S$100,19,0),'PCIA  FF'!$14:$24,MATCH(MAX('PCIA  FF'!$1:$1),'PCIA  FF'!$1:$1,0),0))","v":2.528E-2},0.21167,{"$f":"IF(INDEX(Rates!$A$2:$J$33,MATCH('Rebundled Rates'!$B$2,Rates!$A$2:$A$33,0),MATCH('Rebundled Rates'!B9,Rates!$2:$2,0))=FALSE,\"\",INDEX(Rates!$A$2:$J$33,MATCH('Rebundled Rates'!$B$2,Rates!$A$2:$A$33,0),MATCH('Rebundled Rates'!B9,Rates!$2:$2,0)))","v":0.217},-2.4562211981566828E-2]
["TOU Usage",{"$f":"Rates!H2","v":"Winter Peak"},{"$f":"IF(INDEX(Rates!$A$69:$J$100,MATCH($B$2,Rates!$A$69:$A$100,0),MATCH('Rebundled Rates'!B10,Rates!$2:$2,0))=FALSE,\"\",INDEX(Rates!$A$69:$J$100,MATCH($B$2,Rates!$A$69:$A$100,0),MATCH('Rebundled Rates'!B10,Rates!$2:$2,0)))","v":""},{"$f":"IF(INDEX(Rates!$A$36:$J$65,MATCH('Rebundled Rates'!$B$2,Rates!$A$2:$A$33,0),MATCH('Rebundled Rates'!B10,Rates!$2:$2,0))=FALSE,\"\",G10-INDEX(Rates!$A$36:$J$65,MATCH('Rebundled Rates'!$B$2,Rates!$A$2:$A$33,0),MATCH('Rebundled Rates'!B10,Rates!$2:$2,0)))","v":""},{"$f":"IF(C10=\"\",\"\",VLOOKUP(VLOOKUP($B$2,Rates!$A$68:$S$100,19,0),'PCIA  FF'!$A:$P,MATCH(MAX('PCIA  FF'!$1:$1),'PCIA  FF'!$1:$1,0),0)+VLOOKUP(VLOOKUP($B$2,Rates!$A$68:$S$100,19,0),'PCIA  FF'!$14:$24,MATCH(MAX('PCIA  FF'!$1:$1),'PCIA  FF'!$1:$1,0),0))","v":""},"",{"$f":"IF(INDEX(Rates!$A$2:$J$33,MATCH('Rebundled Rates'!$B$2,Rates!$A$2:$A$33,0),MATCH('Rebundled Rates'!B10,Rates!$2:$2,0))=FALSE,\"\",INDEX(Rates!$A$2:$J$33,MATCH('Rebundled Rates'!$B$2,Rates!$A$2:$A$33,0),MATCH('Rebundled Rates'!B10,Rates!$2:$2,0)))","v":""},""]
{"$rows_left_out":11}
{"sheet":"Changelog","index":6,"n_rows":15,"n_cols":2,"rows_kept":15,"cut":false,"hidden":true,"merged":[]}
["2016-11-15","Added Changelog"]
[null,"Added lbs or metric tons for CO2 switch"]
[null,"Changed CO2e description to CO2 (due to recently discovered information that PG&E emissions only includes CO2 and omits other equivalent gasses which would increase their emissions factor)"]
["2017-01-03","Updated for PG&E AET"]
[null,"Fixed AG-1 A/B maximum demand defect"]
[null,"Fixed AG-4 C demand component defect"]
["2017-03-01","Updated PCIA methodology"]
[null,"Addressed PG&E Solar Choice Calculation issues"]
[null,"Updated PG&E Solar Choice Rates"]
[null,"Updated rates to PG&E 3/1 rate change"]
{"$rows_left_out":5}